RAZON SOCIAL,CLAVE,PAIS,FITCH NACIONAL LP,FITCH NACIONAL CP,FITCH GLOBAL LP,FITCH GLOBAL CP,FECHA REVISION FITCH,S&P NACIONAL LP,S&P NACIONAL CP,S&P GLOBAL LP,S&P GLOBAL CP,FECHA REVISION S&P,MOODYS NACIONAL LP,MOODYS NACIONAL CP,MOODYS GLOBAL LP,MOODYS GLOBAL CP,FECHA REVISION MOODYS,HR NACIONAL LP,HR NACIONAL CP,HR GLOBAL LP,HR GLOBAL CP,FECHA REVISION HR,VERUM NACIONAL LP,VERUM NACIONAL CP,VERUM GLOBAL LP,VERUM GLOBAL CP,FECHA REVISION VERUM,BEST NACIONAL LP,BEST NACIONAL CP,BEST GLOBAL LP,BEST GLOBAL CP,FECHA REVISION BEST,DBRS NACIONAL LP,DBRS NACIONAL CP,DBRS GLOBAL LP,DBRS GLOBAL CP,FECHA REVISION DBRS
3I GROUP PLC,EAF13,GB,,,,,,,,,,,,,,,,,,,,,,,,,,,,,,,,,,,
A CRECER EUM S.A. DE C.V. SOFOM E.N.R.,EAR77,MX,,,,,20230511,,,,,,,,,,,,,,,,,,,,20230502,,,,,,,,,,
AB&C LEASING DE MEXICO S.A.P.I. DE C.V.,ECO1141,MX,AA+ (mex),F1+ (mex),,,20220630,,,,,,,,,,,HR AA+,HR1,,,20230911,,,,,,,,,,,,,,,
ABC CAPITAL S.A. DE C.V. INSTITUCION DE BANCA MULTIPLE,EAR31,MX,BB+ (mex),B (mex),,,20240415,,,,,,,,,,,,,,,20170420,BBB-/M,3/M,,,20240325,,,,,,,,,,
ABENGOA SA,VRM009,MX,,,,,,,,,,,,,,,,,,,,,,,,,,,,,,,,,,,
ABN AMRO BANK N.V.,EBA257,NL,,,A,F1,20211125,,,A,A-1,20230928,,,A1,P-1,20210924,,,,,,,,,,,,,,,,,,A(High),R-1,20200625
ABSA BANK LIMITED,EBA328,ZA,,,,,20220920,,,,,,,,Ba2,,20220405,,,,,,,,,,,,,,,,,,,,
AC BEBIDAS S. DE R.L. DE C.V.,ECO1175,MX,AAA (mex),,A,,20230711,mxAAA,,,,20220314,,,,,,,,,,,,,,,,,,,,,,,,,
ACCEDDE S.A. DE C.V. SOFOM E.N.R.,ESO160,MX,,,,,,,,,,,,,,,,HR BB,HR4,,,20230307,BB-/M,4/M,,,20240319,,,,,,,,,,
ACCENDER LIQUIDEZ SA DE CV SOFOM ENR,000301,MX,,,,,,,,,,,,,,,,,,,,20171109,,,,,,,,,,,,,,,
ACCENDO BANCO S.A. INSTITUCION DE BANCA MULTIPLE,EBA256,MX,,,,,,,,,,20210622,,,,,,,,,,,,,,,20210929,,,,,,,,,,
ACCIONES Y VALORES BANAMEX S.A. DE C.V. CASA DE BOLSA INTEGRANTE DEL GRUPO FINANCIERO BANAMEX,ECB056,MX,AAA (mex),F1+ (mex),,,20170810,mxAAA,mxA-1+,,,20170720,AA.mx,ML A-1.mx,Baa2,P-2,20181203,,,,,,,,,,,,,,,,,,,,
ACE SEGUROS S.A.,EAS58,MX,,,,,,mxAAA,,A,,20171201,,,,,,,,,,,,,,,,,,,,,,,,,
ACEITE S.A. DE C.V.,ECO004,MX,,,,,,,,,,,,,,,,,,,,,,,,,,,,,,,,,,,
ACER-MEX S.A. DE C.V.,ECO006,MX,,,,,,,,,,,,,,,,,,,,,,,,,,,,,,,,,,,
ACRESE SA DE CV SOFOM ENR,EGF109,MX,,,,,,,,,,,,,,,,,,,,20160412,,,,,,,,,,,,,,,
ACTINVER CASA DE BOLSA S.A. DE C.V.,ECB051,MX,AA (mex),F1+ (mex),,,20230829,,,,,,,,,,,HR AA,HR1,,,20230705,AA/M,1+/M,,,20230203,,,,,,,,,,
ACUNSA S.A. DE SEGUROS Y REASEGUROS,EAS214,MX,,,,,,,,,,,,,,,,HR A+,HR2,HR BB (G),HR4 (G),20240409,,,,,,,,,,,,,,,
ADMINISTRACION PORTUARIA INTEGRAL DE CAMPECHE S. A. DE C.V.,ECO900,MX,A+ (mex),,,,20240123,,,,,,,,,,,HR AAA,,,,20231208,,,,,,,,,,,,,,,
ADMINISTRADORA DE ACTIVOS FINANCIEROS TERRACOTA,ECO394,MX,,,,,20060824,,,,,,,,,,,,,,,,,,,,,,,,,,,,,,
AEGON N.V. (AEGON) ,ECO857,NL,,,A,,20160107,,,BBB+,A-2,20221027,,,A3,,20101020,,,,,,,,,,,,,,,,,,,,
AEGON NV,ECO506,NL,,,,,,,,,,,,,,,,,,,,,,,,,,,,,,,,,,,
AEROINVEST S.A. DE C.V.,ECO829,MX,,,,,,,,,,,A+.mx,,Ba1,,20091019,,,,,,,,,,,,,,,,,,,,
AEROPUERTO INTL TOCUMEN,000314,PA,,,,,,,,,,,,,,,,,,,,,,,,,,,,,,,,,,,
AEROPUERTOS ARGEN 2000,ECO895,AR,,,,,,,,,,,,,,,,,,,,,,,,,,,,,,,,,,,
AEROVIAS DE MEXICO S.A. DE C.V.,000238,MX,,,,,,,,,,,,,,,,,,,,,,,,,,,,,,,,,,,
AES ARGENTINA GENERACION,000332,AR,,,B,,20180508,,,B+,,20171030,,,,,,,,,,,,,,,,,,,,,,,,,
AF BANREGIO SA DE CV,EAR025,MX,AA+ (mex),F1+ (mex),,,20180615,,,,,,,,,,20160713,HR AA+,HR+1,,,20180626,,,,,,,,,,,,,,,
AFIANZADORA FIDUCIA S.A. DE C.V.,EAS153,MX,BBB (mex),,,,20231013,,,,,,,,,,,,,,,,,,,,,,,,,,,,,,
AFIPYME S.A. DE C.V.,ESO83,MX,,,,,,,,,,,,,,,,HR A-,HR2,,,20231023,,,,,,,,,,,,,,,
AFIRME GRUPO FINANCIERO S.A. DE C.V.,EGF002,MX,A- (mex),F2 (mex),,,20180530,mxBBB,mxA-2,,,20230825,,,,,,HR A+,HR1,,,20230510,,,,,,,,,,,,,,,
AFORE AZTECA S.A. DE C.V.,ESI31,MX,,,,,,,,,,,,,,,,,,,,,,,,,,,,,,,,,,,
AFORE BANAMEX S.A. DE C.V. INTEGRANTE DEL GRUPO FINANCIERO BANAMEX,ESI33,MX,,,,,,,,,,,,,,,,,,,,,,,,,,,,,,,,,,,
AFORE COPPEL S.A. DE C.V.,ESI32,MX,,,,,,,,,,,,,,,,,,,,,,,,,,,,,,,,,,,
AFORE IXE,ESI014,MX,,,,,,,,,,,,,,,,,,,,,,,,,,,,,,,,,,,
AFORE SURA S.A. DE C.V.,EFO293,MX,,,,,,,,,,,,,,,,,,,,,,,,,,,,,,,,,,,
AFORE XXI BANORTE S.A. DE C.V.,EFO292,MX,,,,,,,,,,,,,,,,,,,,,,,,,,,,,,,,,,,
AFRICAN DEVELOPMENT BANK,EBA179,CV,,,AAA,F1+,20220713,,,AAA,A-1+,20230628,,,Aaa,P-1,20211028,,,,,,,,,,,,,,,,,,,,
AGRICULTURAL BANK OF CHINA LIMITED,EBA258,CN,,,A,F1+,20220729,,,A,A-1,20181216,,,A1,P-1,20201130,,,,,,,,,,,,,,,,,,,,
AGRO FIRME SA DE CV SOFOM ENR,000283,MX,,,,,,,,,,,,,,,,HR A-,HR2,,,20231123,,,,,,,,,,,,,,,
AGRO SOFOM S.A.P.I. DE C.V. SOFOM E.N.R.,ESO162,MX,,,,,,,,,,,,,,,,HR BB+,HR4,,,20230804,,,,,,,,,,,,,,,
AGROASEMEX,EAS69,MX,,,,,,,,,,,,,,,,HR AAA,HR+1,HR BBB+ (G),HR3 (G),20240412,,,,,20230427,,,,,,,,,,
AGROCAPITAL DEL NOROESTE S.A. DE C.V. ,ESO82,MX,,,,,,,,,,,,,,,,HR BBB,HR3,,,20230927,BBB/M,3/M,,,20230731,,,,,,,,,,
AGROFINANCIERA DEL NOROESTE S.A. DE C.V. SOFOL,EAR28,MX,,,,,20120828,,,,,,,,,,,HR BBB-,HR3,,,20230802,BBB-/M,3/M,,,20231023,,,,,,,,,,
AGROFINANCIERA DG S.A. DE C.V.,ESO79,MX,,,,,,,,,,,,,,,,,,,,20180704,,,,,,,,,,,,,,,
AGROFINANCIERA EL VALLE S.A. DE C.V. SOFOM E.N.R.,ECO916,MX,,,,,,,,,,,,,,,,HR BBB,HR3,,,20230927,,,,,,,,,,,,,,,
AGROFINANCIERA S.A. DE C.V.,ESO78,MX,,,,,,,,,,,,,,,,HR BBB+,HR3,,,20230714,A-/M,2/M,,,20240222,,,,,,,,,,
AGROFINANZAS S.A. DE C.V. SOFOL  ,ESO61,MX,BBB (mex),F3 (mex),,,20131115,,,,,,,,,,,HR BBB-,HR3,,,20150917,,,,,,,,,,,,,,,
AGRONEGOCIOS DE CHIHUAHUA S.A. DE C.V. SOFOM E.N.R.,EAR94,MX,,,,,,,,,,,,,,,,,,,,,BBB/M,3/M,,,20240206,,,,,,,,,,
AGROPECUARIA FINANCIERA S.A. DE C.V. SOFOL. ,ESO058,MX,BB (mex),,,,20120829,,,,,,,,,,,HR BB+,HR4,,,20230705,BB+/M,4/M,,,20230526,,,,,,,,,,
AGROSERVICIOS FINANCIEROS ATLAS SA DE CV SOFOM ENR,000269,MX,,,,,,,,,,,,,,,,HR BBB+,HR3,,,20230810,BBB+/M,3/M,,,20220726,,,,,,,,,,
AGUA DE HERMOSILLO (AGUAH),EEG054,MX,BBB+ (mex),,,,20231128,,,,,20130705,,,,,,,,,,,BBB+/M,,,,20220614,,,,,,,,,,
AGUA Y SANEAMIENTOS ARG,ECO1190,AR,,,B,,20180118,,,,,,,,B2,,20180118,,,,,,,,,,,,,,,,,,,,
AGUAS DEL MUNICIPIO DE DURANGO,EEG094,MX,,,,,,,,,,,,,,,20220420,,,,,,,,,,,,,,,,,,,,
AIG SEGUROS MEXICO S.A. DE C.V.,EAS209,MX,,,,,,mxAAA,,A-,,20240116,,,,,,,,,,,,,,,,,,,,,,,,,
AKBANK T.A.S.,EBA259,TR,,,B-,B,20220726,,,,,,,,B2,,20201210,,,,,,,,,,,,,,,,,,,,
AKTIVA FINANCIERA S.A. DE C.V. SOFOM E.N.R.,ESO168,MX,,,,,,,,,,,,,,,,,,,,,BBB-/M,3/M,,,20231207,,,,,,,,,,
ALCOA INC,ECO808,US,,,,,,,,BB-,,20160920,,,Ba2,,20161101,,,,,,,,,,,,,,,,,,,,
ALEATICA MEXICO S.A.B. DE C.V.,ECO1248,MX,,,,,,,,,,,,,,,,,,,,,,,,,,,,,,,,,,,
ALESTRA S.A. DE R.L. DE C.V.,ECO016,MX,,,,,,,,,,20161202,,,B1,,20120604,,,,,,,,,,,,,,,,,,,,
ALFA S.A.B. DE C.V.,ECO106,MX,BBB- (mex),,,,20230301,,,BBB,,20210602,,,Baa3,,20180212,,,,,,,,,,,,,,,,,,,,
ALFAINGENIERIA DE LA ADMINISTRACION S.A. DE C.V.,ECO019,MX,,,,,,,,,,,,,,,,,,,,,,,,,,,,,,,,,,,
ALLIANZ MEXICO S.A. DE C.V. COMPANIA DE SEGUROS,EAS006,MX,,,,,,mxAAA,,BBB,,20200922,,,,,,,,,,,,,,,,aaa.MX,,aa,,20240325,,,,,
ALLY CREDIT S.A. DE C.V. SOFOL,ESO64,MX,,,,,,,,,,,,ML A-3.mx,,,20110208,HR AA-,HR1,,,20130923,,,,,,,,,,,,,,,
ALMACENADORA ACCEL S.A.,EAL001,MX,BBB+ (mex),F2 (mex),,,20231031,,,,,,BBB+.mx,ML A-2.mx,,,20230418,,,,,,,,,,,,,,,,,,,,
ALMACENADORA AFIRME S.A. DE C.V. ORGANIZACION AUXILIAR DEL CREDITO AFIRME GRUPO FINANCIERO,EAL002,MX,,,,,20190530,mxA-,mxA-2,,,20230825,,,,,,HR AA-,HR1,,,20230510,,,,,,,,,,,,,,,
ALMACENADORA BANORTE S.A. DE C.V. ORGANIZACION AUXILIAR DE CREDITO GRUPO FINANCIERO BANORTE,EAL9,MX,AAA (mex),F1+ (mex),,,20231130,,,,,,,,,,,,,,,,,,,,,,,,,,,,,,
ALMACENADORA MERCADER S.A ,EAL003,MX,A+ (mex),F1 (mex),,,20231101,mxA+,mxA-1,,,20210125,,,,,20120313,HR AA-,HR1,,,20230302,AA-/M,1/M,,,20230330,,,,,,,,,,
ALMACENADORA REGIONAL DEL GOLFO S.A. DE C.V.,EAL004,MX,BBB (mex),F3 (mex),,,20050725,mxBBB,mxA-3,,,20050527,,,,,,,,,,,,,,,,,,,,,,,,,
ALMACENADORA SUR S.A.,EAL007,MX,,,,,20221026,,,,,,,,,,20150129,,,,,,D/M,4/M,,,20221028,,,,,,,,,,
ALPEK S.A.B. DE C.V.,ECO926,MX,,,,,,,,BBB-,,20230421,,,Baa3,,20121109,,,,,,,,,,,,,,,,,,,,
ALPHA HOLDING SA,ECO1185,MX,,,,,,,,CCC,,20210422,,,Caa2,,20210421,,,,,,,,,,,,,,,,,,,,
ALPHACREDIT CAPITAL S.A. DE C.V. SOFOM E.N.R.,ECO1136,MX,,,,,,,,,,,,,,,,,,,,,,,,,,,,,,,,,,,
ALSEA S.A.B. DE C.V.,ECO020,MX,A+ (mex),F1 (mex),,,20230904,,,,,,,,,,,HR A+,HR2,,,20231019,,,,,,,,,,,,,,,
ALSOL CONTIGO S.A. DE C.V. SOFOM E.N.R.,EAF8,MX,BBB+ (mex),F2 (mex),,,20231220,,,,,,,,,,,HR A,HR2,,,20240408,,,,,20230126,,,,,,,,,,
ALTOR CASA DE BOLSA S.A. DE C.V.,ECB80,MX,,,,,,mxBBB-,mxA-3,,,20240123,,,,,,,,,,,BBB/M,3/M,,,20230802,,,,,,,,,,
ALTOS HORNOS DE MEXICO,ECO021,MX,,,,,,,,,,,,,,,,,,,,,,,,,,,,,,,,,,,
ALTUM CP S.A.P.I. DE C.V. SOFOM E.N.R.,ESO165,MX,,,,,,,,,,,AA-.mx,,,,20230418,,,,,,,,,,,,,,,,,,,,
AMERICA MOVIL S.A.B. DE C.V.,ECO917,MX,AAA (mex),,A-,,20230703,mxAAA,mxA-1+,A-,,20240226,AAA.mx,,Baa1,,20220712,,,,,,,,,,,,,,,,,,,,
AMERICAN EXPRESS BANK (MEXICO) S.A. INSTITUCION DE BANCA MULTIPLE,EBA002,MX,AAA (mex),F1+ (mex),,,20230829,,,,,20230816,,,,,,,,,,,,,,,,,,,,,,,,,
AMERICAN EXPRESS COMPANY,ECO025,US,,,A,F1,20190819,,,BBB+,A-2,20190607,,,A3,,20190521,,,,,,,,,,,,,,,,,,A(High),R-1,20200807
AMERICAN INTERNATIONAL GROUP INC,ECO630,US,,,BBB,F1+,20120203,,,A,A-2,20220520,,,Baa1,P-2,20110112,,,,,,,,,,,,,,,,,,,,
AMMPER ENERGIA S.A.P.I. DE C.V.,ECO1252,MX,AA- (mex),,,,20231208,,,,,,,,,,,HR AAA,HR+1,HR BBB+ (G),,20230828,,,,,,,,,,,,,,,
ANA COMPANIA DE SEGUROS S.A. DE C.V.,EAS178,MX,,,,,,,,,,,,,,,,,,,,,AA-/M,,,,20230411,,,,,,,,,,
ANALISIS FILTRO E INDICES S.A.P.I. DE C.V. SOFOM E.N.R.,EAR78,MX,,,,,,,,,,,,,,,,,,,,,D/M,4/M,,,20230418,,,,,,,,,,
ANALISTAS DE RECURSOS GLOBALES S.A.P.I. DE C.V.,ECO914,MX,,,,,,,,,,,,,,,,,,,,20190430,,,,,,,,,,,,,,,
AOC MEXICO S.A. DE C.V.,ECO1254,MX,,,,,,,,,,,,,,,,HR A,HR2,,,20231123,,,,,,,,,,,,,,,
APASCO S.A. DE C.V.,ECO026,MX,,,,,,mxAAA,,,,20050401,,,,,,,,,,,,,,,,,,,,,,,,,
APOYO ECONOMICO FAMILIAR S.A. DE C.V. SOFOM,ECO884,MX,A- (mex),F1 (mex),,,20230301,,,,,,,,,,,,,,,,,,,,,,,,,,,,,,
APOYO PROMOTORA SA DE CV SOFOM ENR,ESO108,MX,,,,,,,,,,,,,,,,HR BBB-,HR3,,,20180404,,,,,,,,,,,,,,,
APPLE INC.,VLM251,US,,,,,,,,AA+,A-1+,20200519,,,Aa1,,20160427,,,,,,,,,,,,,,,,,,,,
ARCA CONTINENTAL S.A.B. DE C.V.,ECO1176,MX,AAA (mex),F1+ (mex),A,,20230712,mxAAA,,,,20240223,AAA.mx,,A3,,20220712,,,,,,,,,,,,,,,,,,,,
ARCELORMITTAL S.A.,VLM332,LU,,,BB+,B,20170728,,,,,,,,,,,,,,,,,,,,,,,,,,,,,,
ARCOR SAIC,ECO1166,AR,,,B+,,20180508,,,,,,,,Ba3,,20171204,,,,,,,,,,,,,,,,,,,,
ARCOS DORADOS BV,ECO846,NL,,,,,,,,,,,,,,,,,,,,,,,,,,,,,,,,,,,
ARENDAL S. de R.L. de C.V.,ECO932,MX,,,,,,,,,,,,,,,,,,,,,,,,,,,,,,,,,,,
ARGO ALMACENADORA S.A. DE C.V.,EAL008,MX,,,,,,,,,,20110128,,,,,,,,,,,,,,,,,,,,,,,,,
ARRENDADORA ACTINVER S.A. DE C.V.,EAR51,MX,AA- (mex),F1+ (mex),,,20230829,,,,,,,,,,,HR AA-,HR1,,,20230705,AA-/M,1+/M,,,20230203,,,,,,,,,,
ARRENDADORA AFIRME S.A. DE C.V. SOFOM E.R. AFIRME GRUPO FINANCIERO,EAR002,MX,,,,,20190530,mxA-,mxA-2,,,20230825,,,,,,HR AA-,HR1,,,20230510,,,,,,,,,,,,,,,
ARRENDADORA ARESTRAS.A. DE C.V.,EAR004,MX,,,,,,,,,,,,,,,,,,,,,,,,,,,,,,,,,,,
ARRENDADORA BANCREA S.A. DE C.V. SOFOM E.R.,ESO161,MX,,,,,,,,,,,,,,,,HR A,HR2,,,20230612,A/M,1/M,,,20230601,,,,,,,,,,
ARRENDADORA BANORTE SA DE CV,EAR007,MX,AA+ (mex),F1+ (mex),,,20100712,,,,,,AAA.mx,ML A-1.mx,A3,P-2,20121207,,,,,,,,,,,,,,,,,,,,
ARRENDADORA COMERCIAL AMERICA S.A. DE C.V.,EAR008,MX,AAA (mex),F1+ (mex),,,20040504,mxAA+,mxA-1+,,,20060512,,,,,,,,,,,,,,,,,,,,,,,,,
ARRENDADORA FINANCIERA MARGEN S.A. DE C.V.,EAR010,MX,,,,,,,,,,,,,,,,,,,,,,,,,,,,,,,,,,,
ARRENDADORA FINANCIERA MIFEL S.A DE C.V.,EAR29,MX,,,,,,,,,,,,,,,,,,,,,,,,,,,,,,,,,,,
ARRENDADORA HAVRE. S.A. DE C.V.,EAR018,MX,,,,,,,,,,,,,,,,,,,,,,,,,,,,,,,,,,,
ARRENDADORA UNIFIN S.A. DE C.V.,EAR014,MX,BBB+ (mex),F2 (mex),,,20080828,mxBBB+,mxA-2,,,20081006,,,,,,,,,,,,,,,,,,,,,,,,,
ARRENDADORA VE POR MAS S.A. DE C.V. SOFOM E.R. GRUPO FINANCIERO VE POR MAS,EAR020,MX,A (mex),F1 (mex),,,20220520,,,,,,,,,,20151217,HR A+,HR2,,,20231009,,,,,,,,,,,,,,,
ARRENDADORA Y COMERCIALIZADORA LINGO S.A. DE C.V. SOMOM ENR,EAR37,MX,,,,,20201120,,,,,,,,,,,,,,,20201120,,,,,,,,,,,,,,,
ARRENDADORA Y FACTOR BANORTE S.A. DE C.V. SOFOM E.R.,EAR30,MX,AAA (mex),F1+ (mex),,,20231130,,,,,,AAA.mx,ML A-1.mx,Baa2,P-2,20230418,HR AAA,HR+1,,,20231003,,,,,,,,,,,,,,,
ARRENDADORA Y SOLUCIONES DE NEGOCIOS S.A.P.I. DE C.V. SOFOM E.N.R.,EAR72,MX,,,,,,,,,,,,,,,,,,,,,,,,,,,,,,,,,,,
ASEGURADOR DE SEGUROS BANORTE GENERALI,EAS078,MX,AA (mex),,BBB,,20081113,,,,,,,,,,,,,,,,,,,,,,,,,,,,,,
ASEGURADORA ASERTA S.A. DE C.V. GRUPO FINANCIERO ASERTA,EAF6,MX,AA (mex),,BBB-,,20220819,,,,,,AA+.mx,,Baa2,,20240305,,,,,,,,,,,aaa.MX,,a-,,20231208,,,,,
ASEGURADORA INSURGENTES SA DE CV,EAF7,MX,AA (mex),,BBB-,,20220819,,,,,,AA+.mx,,Baa2,,20240305,,,,,,,,,,,aaa.MX,,a-,,20231208,,,,,
ASEGURADORA INTERACCIONES S.A. DE C.V.,EAS59,MX,,,,,20160627,,,,,,,,,,,,,,,20180824,,,,,,,,,,,,,,,
ASEGURADORA PATRIMONIAL VIDA S.A. DE C.V.,EAS200,MX,,,,,,,,,,,,,,,,,,,,,BBB/M,,,,20230811,,,,,,,,,,
ASERTA SEGUROS VIDA S.A. DE C.V. GRUPO FINANCIERO ASERTA,EAS181,MX,,,,,,,,,,,A.mx,,,,20240305,,,,,,,,,,,,,,,,,,,,
ASF SERVICIOS FINANCIEROS S.A.P.I. DE C.V. SOFOM E.N.R.,EAS163,MX,,,,,,,,,,,,,,,,HR BBB,HR3,,,20231219,,,,,,,,,,,,,,,
ASIAN DEVELOPMENT BANK,ESO126,PH,,,,,,,,AAA,A-1+,20230823,,,Aaa,P-1,20210802,,,,,,,,,,,,,,,,,,,,
ASIGNA COMPENSACION Y LIQUIDACION,EEG001,MX,AAA (mex),F1+ (mex),BBB,F3,20230828,mxAAA,mxA-1+,BBB+,A-2,20220707,,,,,20170605,,,,,,,,,,,,,,,,,,,,
ASSURANT VIDA MEXICO S.A.,EAS191,MX,,,,,,,,,,,,,,,,,,,,,,,,,,aaa.MX,,,,20230223,,,,,
ASSURED GUARANTY MUNI,EAS60,US,,,,,,,,,,,,,,,,,,,,,,,,,,,,,,,,,,,
ASTRAZENECA PLC,ECO496,GB,,,BBB+,,20181012,,,BBB+,A-2,20170728,,,A3,P-2,20180728,,,,,,,,,,,,,,,,,,,,
ATRADIUS SEGUROS DE CREDITO S.A.,EAS074,MX,,,,,,,,,,20121019,,,A3,P-2,20160210,,,,,,,,,,,aaa.MX,,a+,,20230713,,,,,
AUTO AHORRO AUTOMOTRIZ S.A. DE C.V.,ECO030,MX,,,,,,,,,,,,,,,,,,,,20190306,,,,,,,,,,,,,,,
AUTOMOTORES GILDEMEISTER,000222,CL,,,CCC,,20180625,,,,,,,,Ca,,20160401,,,,,,,,,,,,,,,,,,,,
AUTOMOTRIZ APEX S.A.P.I. DE C.V.,EAR73,,,,,,,,,,,,AA+.mx,,,,20220519,,,,,,,,,,,,,,,,,,,,
AUTOPISTA AMOZOC - PEROTE Y LIBRAMIENTO DE PEROTE,ECO1137,MX,,,,,,,,,,,AAA.mx,,,,20220519,,,,,,,,,,,,,,,,,,,,
AUTOPISTA MONTERREY-CADEREYTA,ECO417,MX,,,,,,,,,,,,,,,20180706,,,,,,,,,,,,,,,,,,,,
AUTOPISTA TENANGO - IXTAPAN DE LA SAL S.A. DE C.V.,ECO1158,MX,AA+ (mex),,,,20210831,,,,,,,,,,,,,,,,,,,,,,,,,,,,,,
AUTOVIA NUEVO NECAXA TIHUATLAN S.A. DE C.V.,ECO1250,MX,,,,,,,,,,,,,,,,,,,,,,,,,,,,,,,,,,,
AV PROMOTORA SA DE CV,000285,MX,,,,,,,,,,,,,,,,,,,,,,,,,,,,,,,,,,,
AVANCE Y FORTALECIMIENTO INTEGRAL S.A. DE C.V. SOFOM E.N.R.,ECO416,MX,,,,,,,,,,,,,,,,,,,,20180830,,,,,,,,,,,,,,,
AVLA SEGUROS MEXICO S.A. DE C.V.,EAS204,,,,,,,,,,,,,,,,,HR AA+,HR1,,,20231215,,,,,,aa-.MX,,bbb-,,20230530,,,,,
AXA SALUD S.A. DE C.V.,EAS210,MX,,,,,,mxAAA,,,,20240116,,,,,,,,,,,,,,,,,,,,,,,,,
AXA SEGUROS S.A. DE  C.V. ,EAS57,MX,,,,,,mxAAA,,A-,,20240117,,,,,,,,,,,,,,,,,,,,,,,,,
AXTEL S.A.B. DE C.V.,ECO627,MX,A- (mex),,BB-,,20231130,,,BB,,20160221,,,Caa2,,20120807,,,,,,,,,,,,,,,,,,,,
BAKER HUGHES INC,ECO418,US,,,,,,,,A-,A-1,20230324,,,Ba1,P-2,20161030,,,,,,,,,,,,,,,,,,,,
BANCA AFIRME S.A. INSTITUCION DE BANCA MULTIPLE AFIRME GRUPO FINANCIERO,EBA006,MX,,,,,20190530,mxA-,mxA-2,,,20230908,,,,,,HR AA-,HR1,,,20230510,,,,,,,,,,,,,,,
BANCA MARCH S.A.,EBA306,ES,,,,,,,,,,,,,A3,P-2,20191021,,,,,,,,,,,,,,,,,,,,
BANCA MIFEL S.A. INSTITUCION DE BANCA MULTIPLE GRUPO FINANCIERO MIFEL,EBA037,MX,A (mex),F1 (mex),,,20230515,mxA-,mxA-2,,,20240215,,,,,,HR A+,HR2,,,20230921,,,,,,,,,,,,,,,
BANCA NAZIONALE DEL LAVORO S.P.A.,EBA299,IT,,,BBB+,F1,20220210,,,BBB+,A-2,20200423,,,Baa1,P-2,20220809,,,,,,,,,,,,,,,,,,A(High),R-1,20200710
BANCA POPOLARE DI SONDRIO,EBA260,IT,,,BB+,B,20220727,,,,,,,,,,,,,,,,,,,,,,,,,,,,BBB(Low),R-2,20201116
BANCO ACTINVER,EBA158,MX,AA (mex),F1+ (mex),,,20230829,,,,,,,,,,,HR AA,HR1,,,20230705,AA/M,1+/M,,,20230203,,,,,,,,,,
BANCO AHORRO FAMSA S.A. INSTITUCION DE BANCA MULTIPLE,EBA161,MX,,,,,20170310,,,,,20190222,,,,,20200608,,,,,20160606,,,,,20191112,,,,,,,,,,
BANCO AMIGO S.A. ,EBA167,MX,BBB (mex),F3 (mex),,,20110517,,,,,,,,,,,HR BBB+,HR3,,,20110317,,,,,,,,,,,,,,,
BANCO AUTOFIN MEXICO S.A. INSTITUCION DE BANCA MULTIPLE,EBA134,MX,,,,,20140530,,,,,,,,,,20111118,HR BBB-,HR3,,,20230421,BBB-/M,3/M,,,20230322,,,,,,,,,,
BANCO AZTECA S.A. INSTITUCION DE BANCA MULTIPLE,EBA015,MX,,,,,20240418,,,,,,A.mx,ML A-1.mx,Ba2,,20230418,HR AA-,HR1,,,20230707,,,,,,,,,,,,,,,
BANCO BANCREA SA,EBA223,MX,A- (mex),F1 (mex),,,20230512,,,,,,,,,,,HR A,HR2,,,20220620,A/M,1/M,,,20230601,,,,,,,,,,
BANCO BASE S.A. DE C.V. ,ECB049,MX,A (mex),F1 (mex),,,20230913,mxA-,mxA-2,,,20220420,A+.mx,ML A-1.mx,,,20231030,,,,,,,,,,,,,,,,,,,,
BANCO BBVA PERU S.A.,EBA204,PE,,,BBB+,F2,20210415,,,BBB+,A-2,20210105,,,Baa1,P-2,20210427,,,,,,,,,,,,,,,,,,,,
BANCO BILBAO VIZCAYA ARGENTARIA PARAGUAY S.A.,EBA262,PY,,,,,,,,,,,,,Ba1,,20201231,,,,,,,,,,,,,,,,,,,,
BANCO BILBAO VIZCAYA ARGENTARIA S.A.,EBA214,ES,,,BBB+,F2,20220525,,,A-,A-2,20180406,,,A2,P-1,20200910,,,,,,,,,,,,,,,,,,A(High),R-1,20200401
BANCO BILBAO VIZCAYA ARGENTARIA S.A. (LONDON BRANCH),EFA33,GB,,,,,,,,,,,,,A2,P-1,20190619,,,,,,,,,,,,,,,,,,,,
BANCO BILBAO VIZCAYA ARGENTARIA S.A. NEW YORK,EBA172,US,,,,,,,,,,,,,A2,P-1,20190619,,,,,,,,,,,,,,,,,,,,
BANCO BILBAO VIZCAYA ARGENTARIA URUGUAY S.A.,EBA261,UY,,,,,,,,BBB,A-2,20151007,,,,,,,,,,,,,,,,,,,,,,,,,
BANCO BISA S.A.,EBA263,BO,,,,,,,,,,,,,,,,,,,,,,,,,,,,,,,,,,,
BANCO BMG S.A.,EBA099,BR,,,,,,,,B,,20140915,,,B1,,20140915,,,,,,,,,,,,,,,,,,,,
BANCO BRADESCO (CAYMAN),EBA100,BR,,,,F3,20060727,,,BB-,B,20230615,,,,,,,,,,,,,,,,,,,,,,,,,
BANCO BTG PACTUAL/CAYMAN,ECO941,MX,,,,,,mxB+,mxB,B+,,20160217,,,Baa3,,20160401,HR A-,HR2,,,20170616,,,,,,,,,,,,,,,
BANCO CENTROAMERICANO DE INTEGRACION ECONOMICA,EBA118,MX,,,,,20190305,mxAAA,,AA,A-1+,20220915,AAA.mx,,Aa3,P-1,20220519,,,,,,,,,,,,,,,,,,,,
BANCO COMERCIAL PORTUGUES S.A.,EBA300,PT,,,BB,B,20211011,,,BB,B,20200408,,,Baa2,P-2,20220614,,,,,,,,,,,,,,,,,,BBB(Low),R-2,20200528
BANCO COMPARTAMOS S.A. INSTITUCION DE BANCA MULTIPLE,EBA119,MX,AA (mex),F1+ (mex),BB+,B,20231006,mxAA,mxA-1+,BB+,B,20221026,AA.mx,ML A-1.mx,,,20230418,,,,,,,,,,,,,,,,,,,,
BANCO CREDIT SUISSE (MEXICO) S.A. INSTITUCION DE BANCA MULTIPLE GRUPO FINANCIERO CREDIT SUISSE (MEXICO),EBA017,MX,,,,,,mxAAA,mxA-1+,,,20220419,,,,,20121008,HR AAA,HR+1,,,20240319,,,,,,,,,,,,,,,
BANCO DAVIVIENDA (COSTA RICA) S.A.,EBA264,CR,,,B+,B,20200514,,,,,,,,,,,,,,,,,,,,,,,,,,,,,,
BANCO DAYCOVAL SA,EBA144,BR,,,,,,,,BB-,,20160314,,,,,,,,,,,,,,,,,,,,,,,,,
BANCO DE BOGOTA SA,EBA189,CO,,,BBB,F2,20170630,,,BB+,B,20171212,,,Baa2,P-2,20180223,,,,,,,,,,,,,,,,,,,,
BANCO DE CHILE S.A. DE C.V. ,EBA174,CL,,,,,,,,A,A-1,20231020,,,A1,P-1,20200402,,,,,,,,,,,,,,,,,,,,
BANCO DE COSTA RICA,EBA218,CR,,,B,B,20200925,,,B,B,20200612,,,B2,,20201211,,,,,,,,,,,,,,,,,,,,
BANCO DE CREDITO DE BOLIVIA S.A.,EBA265,BO,,,B,B,20201008,,,,,,,,,,20190628,,,,,,,,,,,,,,,,,,,,
BANCO DE CREDITO DEL PERU,EBA185,PE,,,BBB,F2,20220407,,,BBB+,A-2,20181120,,,Baa1,P-2,20210902,,,,,,,,,,,,,,,,,,,,
BANCO DE CREDITO E INVERSIONES S.A. DE C.V. ,EBA171,CL,,,,,,,,,,,,,,,,,,,,,,,,,,,,,,,,,,,
BANCO DE INVERSION AFIRME S.A. INSTITUCION DE BANCA MULTIPLE AFIRME GRUPO FINANCIERO,EBA251,MX,,,,,20190530,mxA-,mxA-2,,,20230908,,,,,,HR AA-,HR1,,,20230510,,,,,,,,,,,,,,,
BANCO DE MEXICO,EEG002,MX,,,,,,,,,,,,,,,,,,,,,,,,,,,,,,,,,,,
BANCO DE OCCIDENTE,EBA195,CO,,,BBB,B,20211210,,,,,,,,,,,,,,,,,,,,,,,,,,,,,,
BANCO DEL AHORRO NACIONAL Y SERVICIOS FINANCIEROS SNC,EEG152,MX,AAA (mex),F1+ (mex),,,20190624,mxAAA,mxA-1+,,,20190608,,,,,,,,,,,,,,,,,,,,,,,,,
BANCO DEL BAJIO S.A. INSTITUCION DE BANCA MULTIPLE,EBA022,MX,AA (mex),F1+ (mex),BB+,B,20231025,,,,,,AA+.mx,ML A-1.mx,Baa2,P-2,20230418,HR AAA,HR+1,HR BBB+ (G),,20220902,AAA/M,1+/M,,,20240223,,,,,,,,,,
BANCO DEL BIENESTAR S.N.C.,EBA297,MX,AAA (mex),F1+ (mex),,,20230620,,,,,20220112,AAA.mx,ML A-1.mx,,,20230418,,,,,,,,,,,,,,,,,,,,
BANCO DEL ESTADO-CHILE,EBA200,CL,,,,,20190607,,,A+,A-1,20170714,,,A1,P-1,20210204,,,,,,,,,,,,,,,,,,,,
BANCO DO BRASIL (CAYMAN),ECO501,KY,,,,,,,,,,,,,Ba2,,20160225,,,,,,,,,,,,,,,,,,,,
BANCO DO BRASIL S.A.,VRM130,BR,,,BB-,B,20220601,,,BB-,B,20180112,,,Ba3,,20180531,,,,,,,,,,,,,,,,,,,,
BANCO FINTERRA SA,EBA229,MX,,,,,20190218,mxBB,mxB,,,20220420,,,,,,,,,,,BBB-/M,3/M,,,20220620,,,,,,,,,,
BANCO FORJADORES SA,EBA238,MX,,,,,,,,,,,,,,,,HR BB+,HR4,,,20230908,BB/M,4/M,,,20230929,,,,,,,,,,
BANCO GENERAL SA,EBA243,PA,,,BBB+,F2,20170719,,,BBB,A-2,20231108,,,Baa2,P-2,20171212,,,,,,,,,,,,,,,,,,,,
BANCO HIPOTECARIO SA,EBA245,AR,,,B,B,20171117,,,B+,,20171030,,,B3,,20171206,,,,,,,,,,,,,,,,,,,,
BANCO INBURSA S.A. INSTITUCION DE BANCA MULTIPLE GRUPO FINANCIERO INBURSA,EBA025,MX,AAA (mex),F1+ (mex),BBB-,F3,20231025,mxAAA,mxA-1+,BBB,A-2,20231013,,,,,,HR AAA,HR+1,,,20231213,,,,,,,,,,,,,,,
BANCO INDUSTRIAL E COMERCIAL S.A.,EBA160,BR,,,,,,,,BB+,,20120808,,,Baa3,P-3,20100913,,,,,,,,,,,,,,,,,,,,
BANCO INDUSTRIAL S.A.,EBA247,GU,,,BB-,B,20220509,,,BB-,B,20171019,,,Ba1,,20201211,,,,,,,,,,,,,,,,,,,,
BANCO INMOBILIARIO MEXICANO SA,EBA231,MX,,,,,,,,,,20210426,,,,,,HR BBB,HR3,,,20230623,BBB/M,3/M,,,20230915,,,,,,,,,,
BANCO INMOBILIARIO S.A.,EBA217,MX,,,,,,,,,,,,,,,,,,,,20141210,,,,,,,,,,,,,,,
BANCO INTERACCIONES S.A. INSTITUCION DE BANCA MULTIPLE,EBA027,MX,,,,,20180723,,,,,,,,,,20180718,,,,,20180824,,,,,,,,,,,,,,,
BANCO INTERAMERICANO DE DESARROLLO,EBA028,CR,,,,,,,,AAA,A-1+,20080725,,,Aaa,,20120626,,,,,,,,,,,,,,,,,,,,
BANCO INTERNACIONAL DEL PERU,EBA208,PA,,,BBB+,F3,20220407,,,BBB,,20161215,,,Baa1,P-2,20210902,,,,,,,,,,,,,,,,,,,,
BANCO INTERNACIONAL S.A.,EBA029,,AAA (mex),F1 (mex),,,20230630,,,,,20240207,,,,,,,,,,,,,,,,,,,,,,,,,
BANCO INVEX S.A.,EBA030,MX,AA- (mex),F1+ (mex),,,20220525,mxAA-,mxA-1+,,,20220923,AA-.mx,ML A-1.mx,,,20220610,,,,,,,,,,,,,,,,,,,,
BANCO INVEX SA INSTITUCION DE BANCA MULTIPLE INVEX GRUPO FINANCIERO,VRM885,MX,AA- (mex),F1+ (mex),,,20230522,mxA+,mxA-1,,,20220420,AA-.mx,ML A-1.mx,,,20230901,,,,,,,,,,,,,,,,,,,,
BANCO ITAU URUGUAY S.A.,EBA307,UY,,,,,,,,,,,,,Baa3,P-3,20190426,,,,,,,,,,,,,,,,,,,,
BANCO J.P. MORGAN S.A. INSTITUCION DE BANCA MULTIPLE J.P. MORGAN GRUPO FINANCIERO,EBA166,MX,AAA (mex),F1+ (mex),,,20240319,mxAAA,mxA-1+,,,20220429,,,,,,,,,,,,,,,,,,,,,,,,,
BANCO KEB HANA MEXICO S.A. INSTITUCION DE BANCA MULTIPLE,EBA293,MX,AAA (mex),F1+ (mex),,,20240227,,,,,,,,,,,HR AAA,HR+1,,,20230616,,,,,,,,,,,,,,,
BANCO LATINOAMERICANO DE COMERCIO EXTERIOR S.A.,EBA175,MX,,F1 (mex),BBB,F2,20230818,,,BBB,A-2,20220419,,,Baa2,P-2,20200527,,,,,,,,,,,,,,,,,,,,
BANCO MACRO SA,EBA241,AR,,,B,B,20180511,,,,,,,,B3,,20171206,,,,,,,,,,,,,,,,,,,,
BANCO MERCANTIL DEL NORTE S.A. INSTITUCION DE BANCA MULTIPLE GRUPO FINANCIERO BANORTE,EGF014,MX,AAA (mex),F1+ (mex),BBB-,F3,20231130,mxAAA,mxA-1+,BBB,A-2,20220914,AAA.mx,ML A-1.mx,Baa2,P-2,20230418,HR AAA,HR+1,,,20231002,,,,,,,,,,,,,,,
BANCO MERCANTIL SANTA CRUZ S.A.,EBA266,BO,,,,,,,,BB-,B,20170329,,,B1,,20170802,,,,,,,,,,,,,,,,,,,,
BANCO MONEX S.A. INSTITUCION DE BANCA MULTIPLE,EBA113,MX,AA- (mex),F1+ (mex),BB+,B,20230913,,,,,20190717,,,,,,HR AA,HR1,,,20231009,,,,,,,,,,,,,,,
BANCO MULTIVA S.A. INSTITUCION DE BANCA MULTIPLE MULTIVALORES GRUPO FINANCIERO,EBA132,MX,A- (mex),F1 (mex),,,20230522,mxA-,mxA-2,,,20220420,,,,,20121010,HR A+,HR1,,,20240425,,,,,,,,,,,,,,,
BANCO NAC DE DESEN ECONO,EBA095,BR,,,,,,,,,,,,,Ba3,,20170531,,,,,,,,,,,,,,,,,,,,
BANCO NACIONAL DE BOLIVIA S.A.,EBA267,BO,,,,,,,,,,,,,B1,,20170802,,,,,,,,,,,,,,,,,,,,
BANCO NACIONAL DE COMERCIO EXTERIOR S.N.C.,EBA039,MX,AAA (mex),F1+ (mex),BBB-,F3,20230620,mxAAA,mxA-1+,BBB,A-2,20221107,AAA.mx,ML A-1.mx,Baa2,P-2,20230418,,,,,,,,,,,,,,,,,,,,
BANCO NACIONAL DE MEXICO S.A. INSTITUCION DE BANCA MULTIPLE GRUPO FINANCIERO BANAMEX,EBA040,MX,AAA (mex),F1+ (mex),BBB+,F1,20231130,mxAAA,mxA-1+,BBB,A-2,20240215,AAA.mx,ML A-1.mx,Baa1,P-2,20230418,,,,,,,,,,,,,,,,,,,,
BANCO NACIONAL DE OBRAS Y SERVICIOS PUBLICOS S.N.C.,EBA041,MX,AAA (mex),F1+ (mex),BBB-,F3,20230620,mxAAA,mxA-1+,BBB,A-2,20220707,AAA.mx,ML A-1.mx,Baa1,P-2,20230418,,,,,,,,,,,,,,,,,,,,
BANCO NACIONAL DEL EJERCITO FUERZA AEREA Y ARMADA  S.N.C.,EBA146,MX,AAA (mex),F1+ (mex),,,20230620,,,,,,,,,,,,,,,,,,,,,,,,,,,,,,
BANCO PANAMERICANO SA,ECO500,PA,,,,,,,,,,,,,,,,,,,,,,,,,,,,,,,,,,,